{"text_format":"1","workbook":"xlsx","n_sheets":5,"sheets":["AP Accrual Form","Reversing","Departments","Upload","MacroUseOnly"],"not_rendered":{"charts":0,"images":0,"macros":1,"external_links":1,"defined_names":5,"comments":0,"pivot_tables":0},"unopened":[],"bounds":{"document_bytes":16777216,"sheet_cells":100000,"rows_first":2000,"rows_last":500,"rows_between":2000,"halvings":0,"cell_chars":16384,"cell_head_chars":4096},"cells_cut":0,"cells_raw":0,"read":"whole","date_system":"1900"}

{"sheet":"AP Accrual Form","index":0,"n_rows":50,"n_cols":11,"rows_kept":50,"cut":false,"hidden":false,"merged":[[49,1,49,6],[0,0,0,10],[1,0,1,10],[12,2,12,4],[10,2,10,4],[10,9,10,10]]}
[{"$f":"C15 & \" Accounts Payable Accrual Form FY25-26 V1\"","v":"CICMP Accounts Payable Accrual Form FY25-26 V1"}]
[" Due Wednesday,  June 24, 2026"]
["Directions:"]
["1 - Select the Business Unit for the accruals.  Business units cannot be comingled on this form."]
["2 - Each accrual must be listed separately on the below worksheet -- one line per expense accrual."]
["3 - Each accrual must have supporting back-up, with the dollar amount being accrued \"highlighted\" on the back-up. "]
["4 - Accruals pertain only to items or services purchased and delivered by June 30, 2026 for FY25-26. Delivery confirmation is required for an item to be accrued and must be included as back-up."]
["5 - Accruals will not be accepted for purchases under $500."]
["6 - This form and all supporting documentation will only be accepted via email to CIAP@CSUCI.EDU.  "]
[]
[null,"Preparer:",null,null,null,null,null,null,null,"FINANCE USE ONLY"]
[]
[null,"Date:"]
[]
[null,"Business Unit:","CICMP"]
[]
[null,"Account","Fund","Dept","Program","Class","Project","Vendor Name","Reason for Accrual","Invoice Date","Amount"]
[]
[{"$f":"1","v":1}]
[{"$f":"1+A19","v":2}]
[3]
[4]
[5]
[6]
[7]
[8]
[9]
[10]
[11]
[12]
[13]
[14]
[15]
[16]
[17]
[18]
[19]
[20]
[21]
[22]
{"$rows_left_out":11}
{"sheet":"Reversing","index":1,"n_rows":50,"n_cols":11,"rows_kept":50,"cut":false,"hidden":true,"merged":[[49,1,49,6],[0,0,0,10],[1,0,1,10],[10,2,10,4],[10,9,10,10],[12,2,12,4]]}
[{"$f":"C15 & \" Accounts Payable Accrual Form FY20-21\"","v":"CICMP Accounts Payable Accrual Form FY20-21"}]
[" Due Friday, June 30, 2021"]
["Directions:"]
["1 - Select the Business Unit for the accruals.  Business units cannot be comingled on this form."]
["2 - Each accrual must be listed separately on the below worksheet -- one line per expense accrual."]
["3 - Each accrual must have supporting back-up, with the dollar amount being accrued \"highlighted\" on the back-up. "]
["4 - Accruals pertain only to items or services purchased and delivered by June 30, 2021 for FY20-21. Delivery confirmation is required for an item to be accrued and must be included as back-up."]
["5 - Accruals will not be accepted for purchases under $500."]
["6 - This form and all supporting documentation will only be accepted via email to Myrna StaAna (myrna.staana@csuci.edu). "]
[]
[null,"Preparer:",null,null,null,null,null,null,null,"FINANCE USE ONLY"]
[]
[null,"Date:"]
[]
[null,"Business Unit:","CICMP"]
[]
[null,"Account","Fund","Dept","Program","Class","Project","Vendor Name","Reason for Accrual","Invoice Date","Amount"]
[]
[{"$f":"1","v":1},{"$f":"IF('AP Accrual Form'!B19=0,\"\",'AP Accrual Form'!B19)","v":""},{"$f":"IF('AP Accrual Form'!C19=0,\"\",'AP Accrual Form'!C19)","v":""},{"$f":"IF('AP Accrual Form'!D19=0,\"\",VLOOKUP('AP Accrual Form'!D19,Departments!A:C,3,FALSE))","v":""},{"$f":"IF('AP Accrual Form'!E19=0,\"\",'AP Accrual Form'!E19)","v":""},{"$f":"IF('AP Accrual Form'!F19=0,\"\",'AP Accrual Form'!F19)","v":""},{"$f":"IF('AP Accrual Form'!G19=0,\"\",'AP Accrual Form'!G19)","v":""},{"$f":"IF('AP Accrual Form'!H19=0,\"\",'AP Accrual Form'!H19)","v":""},{"$f":"IF('AP Accrual Form'!I19=0,\"\",'AP Accrual Form'!I19)","v":""},{"$f":"IF('AP Accrual Form'!J19=0,\"\",'AP Accrual Form'!J19)","v":""},{"$f":"IF('AP Accrual Form'!K19=0,\"\",-'AP Accrual Form'!K19)","v":""}]
[{"$f":"1+A19","v":2},{"$f":"IF('AP Accrual Form'!B20=0,\"\",'AP Accrual Form'!B20)","v":""},{"$f":"IF('AP Accrual Form'!C20=0,\"\",'AP Accrual Form'!C20)","v":""},{"$f":"IF('AP Accrual Form'!D20=0,\"\",VLOOKUP('AP Accrual Form'!D20,Departments!A:C,3,FALSE))","v":""},{"$f":"IF('AP Accrual Form'!E20=0,\"\",'AP Accrual Form'!E20)","v":""},{"$f":"IF('AP Accrual Form'!F20=0,\"\",'AP Accrual Form'!F20)","v":""},{"$f":"IF('AP Accrual Form'!G20=0,\"\",'AP Accrual Form'!G20)","v":""},{"$f":"IF('AP Accrual Form'!H20=0,\"\",'AP Accrual Form'!H20)","v":""},{"$f":"IF('AP Accrual Form'!I20=0,\"\",'AP Accrual Form'!I20)","v":""},{"$f":"IF('AP Accrual Form'!J20=0,\"\",'AP Accrual Form'!J20)","v":""},{"$f":"IF('AP Accrual Form'!K20=0,\"\",-'AP Accrual Form'!K20)","v":""}]
[3,{"$f":"IF('AP Accrual Form'!B21=0,\"\",'AP Accrual Form'!B21)","v":""},{"$f":"IF('AP Accrual Form'!C21=0,\"\",'AP Accrual Form'!C21)","v":""},{"$f":"IF('AP Accrual Form'!D21=0,\"\",VLOOKUP('AP Accrual Form'!D21,Departments!A:C,3,FALSE))","v":""},{"$f":"IF('AP Accrual Form'!E21=0,\"\",'AP Accrual Form'!E21)","v":""},{"$f":"IF('AP Accrual Form'!F21=0,\"\",'AP Accrual Form'!F21)","v":""},{"$f":"IF('AP Accrual Form'!G21=0,\"\",'AP Accrual Form'!G21)","v":""},{"$f":"IF('AP Accrual Form'!H21=0,\"\",'AP Accrual Form'!H21)","v":""},{"$f":"IF('AP Accrual Form'!I21=0,\"\",'AP Accrual Form'!I21)","v":""},{"$f":"IF('AP Accrual Form'!J21=0,\"\",'AP Accrual Form'!J21)","v":""},{"$f":"IF('AP Accrual Form'!K21=0,\"\",-'AP Accrual Form'!K21)","v":""}]
[4,{"$f":"IF('AP Accrual Form'!B22=0,\"\",'AP Accrual Form'!B22)","v":""},{"$f":"IF('AP Accrual Form'!C22=0,\"\",'AP Accrual Form'!C22)","v":""},{"$f":"IF('AP Accrual Form'!D22=0,\"\",VLOOKUP('AP Accrual Form'!D22,Departments!A:C,3,FALSE))","v":""},{"$f":"IF('AP Accrual Form'!E22=0,\"\",'AP Accrual Form'!E22)","v":""},{"$f":"IF('AP Accrual Form'!F22=0,\"\",'AP Accrual Form'!F22)","v":""},{"$f":"IF('AP Accrual Form'!G22=0,\"\",'AP Accrual Form'!G22)","v":""},{"$f":"IF('AP Accrual Form'!H22=0,\"\",'AP Accrual Form'!H22)","v":""},{"$f":"IF('AP Accrual Form'!I22=0,\"\",'AP Accrual Form'!I22)","v":""},{"$f":"IF('AP Accrual Form'!J22=0,\"\",'AP Accrual Form'!J22)","v":""},{"$f":"IF('AP Accrual Form'!K22=0,\"\",-'AP Accrual Form'!K22)","v":""}]
[5,{"$f":"IF('AP Accrual Form'!B23=0,\"\",'AP Accrual Form'!B23)","v":""},{"$f":"IF('AP Accrual Form'!C23=0,\"\",'AP Accrual Form'!C23)","v":""},{"$f":"IF('AP Accrual Form'!D23=0,\"\",VLOOKUP('AP Accrual Form'!D23,Departments!A:C,3,FALSE))","v":""},{"$f":"IF('AP Accrual Form'!E23=0,\"\",'AP Accrual Form'!E23)","v":""},{"$f":"IF('AP Accrual Form'!F23=0,\"\",'AP Accrual Form'!F23)","v":""},{"$f":"IF('AP Accrual Form'!G23=0,\"\",'AP Accrual Form'!G23)","v":""},{"$f":"IF('AP Accrual Form'!H23=0,\"\",'AP Accrual Form'!H23)","v":""},{"$f":"IF('AP Accrual Form'!I23=0,\"\",'AP Accrual Form'!I23)","v":""},{"$f":"IF('AP Accrual Form'!J23=0,\"\",'AP Accrual Form'!J23)","v":""},{"$f":"IF('AP Accrual Form'!K23=0,\"\",-'AP Accrual Form'!K23)","v":""}]
[6,{"$f":"IF('AP Accrual Form'!B24=0,\"\",'AP Accrual Form'!B24)","v":""},{"$f":"IF('AP Accrual Form'!C24=0,\"\",'AP Accrual Form'!C24)","v":""},{"$f":"IF('AP Accrual Form'!D24=0,\"\",VLOOKUP('AP Accrual Form'!D24,Departments!A:C,3,FALSE))","v":""},{"$f":"IF('AP Accrual Form'!E24=0,\"\",'AP Accrual Form'!E24)","v":""},{"$f":"IF('AP Accrual Form'!F24=0,\"\",'AP Accrual Form'!F24)","v":""},{"$f":"IF('AP Accrual Form'!G24=0,\"\",'AP Accrual Form'!G24)","v":""},{"$f":"IF('AP Accrual Form'!H24=0,\"\",'AP Accrual Form'!H24)","v":""},{"$f":"IF('AP Accrual Form'!I24=0,\"\",'AP Accrual Form'!I24)","v":""},{"$f":"IF('AP Accrual Form'!J24=0,\"\",'AP Accrual Form'!J24)","v":""},{"$f":"IF('AP Accrual Form'!K24=0,\"\",-'AP Accrual Form'!K24)","v":""}]
[7,{"$f":"IF('AP Accrual Form'!B25=0,\"\",'AP Accrual Form'!B25)","v":""},{"$f":"IF('AP Accrual Form'!C25=0,\"\",'AP Accrual Form'!C25)","v":""},{"$f":"IF('AP Accrual Form'!D25=0,\"\",VLOOKUP('AP Accrual Form'!D25,Departments!A:C,3,FALSE))","v":""},{"$f":"IF('AP Accrual Form'!E25=0,\"\",'AP Accrual Form'!E25)","v":""},{"$f":"IF('AP Accrual Form'!F25=0,\"\",'AP Accrual Form'!F25)","v":""},{"$f":"IF('AP Accrual Form'!G25=0,\"\",'AP Accrual Form'!G25)","v":""},{"$f":"IF('AP Accrual Form'!H25=0,\"\",'AP Accrual Form'!H25)","v":""},{"$f":"IF('AP Accrual Form'!I25=0,\"\",'AP Accrual Form'!I25)","v":""},{"$f":"IF('AP Accrual Form'!J25=0,\"\",'AP Accrual Form'!J25)","v":""},{"$f":"IF('AP Accrual Form'!K25=0,\"\",-'AP Accrual Form'!K25)","v":""}]
[8,{"$f":"IF('AP Accrual Form'!B26=0,\"\",'AP Accrual Form'!B26)","v":""},{"$f":"IF('AP Accrual Form'!C26=0,\"\",'AP Accrual Form'!C26)","v":""},{"$f":"IF('AP Accrual Form'!D26=0,\"\",VLOOKUP('AP Accrual Form'!D26,Departments!A:C,3,FALSE))","v":""},{"$f":"IF('AP Accrual Form'!E26=0,\"\",'AP Accrual Form'!E26)","v":""},{"$f":"IF('AP Accrual Form'!F26=0,\"\",'AP Accrual Form'!F26)","v":""},{"$f":"IF('AP Accrual Form'!G26=0,\"\",'AP Accrual Form'!G26)","v":""},{"$f":"IF('AP Accrual Form'!H26=0,\"\",'AP Accrual Form'!H26)","v":""},{"$f":"IF('AP Accrual Form'!I26=0,\"\",'AP Accrual Form'!I26)","v":""},{"$f":"IF('AP Accrual Form'!J26=0,\"\",'AP Accrual Form'!J26)","v":""},{"$f":"IF('AP Accrual Form'!K26=0,\"\",-'AP Accrual Form'!K26)","v":""}]
[9,{"$f":"IF('AP Accrual Form'!B27=0,\"\",'AP Accrual Form'!B27)","v":""},{"$f":"IF('AP Accrual Form'!C27=0,\"\",'AP Accrual Form'!C27)","v":""},{"$f":"IF('AP Accrual Form'!D27=0,\"\",VLOOKUP('AP Accrual Form'!D27,Departments!A:C,3,FALSE))","v":""},{"$f":"IF('AP Accrual Form'!E27=0,\"\",'AP Accrual Form'!E27)","v":""},{"$f":"IF('AP Accrual Form'!F27=0,\"\",'AP Accrual Form'!F27)","v":""},{"$f":"IF('AP Accrual Form'!G27=0,\"\",'AP Accrual Form'!G27)","v":""},{"$f":"IF('AP Accrual Form'!H27=0,\"\",'AP Accrual Form'!H27)","v":""},{"$f":"IF('AP Accrual Form'!I27=0,\"\",'AP Accrual Form'!I27)","v":""},{"$f":"IF('AP Accrual Form'!J27=0,\"\",'AP Accrual Form'!J27)","v":""},{"$f":"IF('AP Accrual Form'!K27=0,\"\",-'AP Accrual Form'!K27)","v":""}]
[10,{"$f":"IF('AP Accrual Form'!B28=0,\"\",'AP Accrual Form'!B28)","v":""},{"$f":"IF('AP Accrual Form'!C28=0,\"\",'AP Accrual Form'!C28)","v":""},{"$f":"IF('AP Accrual Form'!D28=0,\"\",VLOOKUP('AP Accrual Form'!D28,Departments!A:C,3,FALSE))","v":""},{"$f":"IF('AP Accrual Form'!E28=0,\"\",'AP Accrual Form'!E28)","v":""},{"$f":"IF('AP Accrual Form'!F28=0,\"\",'AP Accrual Form'!F28)","v":""},{"$f":"IF('AP Accrual Form'!G28=0,\"\",'AP Accrual Form'!G28)","v":""},{"$f":"IF('AP Accrual Form'!H28=0,\"\",'AP Accrual Form'!H28)","v":""},{"$f":"IF('AP Accrual Form'!I28=0,\"\",'AP Accrual Form'!I28)","v":""},{"$f":"IF('AP Accrual Form'!J28=0,\"\",'AP Accrual Form'!J28)","v":""},{"$f":"IF('AP Accrual Form'!K28=0,\"\",-'AP Accrual Form'!K28)","v":""}]
[11,{"$f":"IF('AP Accrual Form'!B29=0,\"\",'AP Accrual Form'!B29)","v":""},{"$f":"IF('AP Accrual Form'!C29=0,\"\",'AP Accrual Form'!C29)","v":""},{"$f":"IF('AP Accrual Form'!D29=0,\"\",VLOOKUP('AP Accrual Form'!D29,Departments!A:C,3,FALSE))","v":""},{"$f":"IF('AP Accrual Form'!E29=0,\"\",'AP Accrual Form'!E29)","v":""},{"$f":"IF('AP Accrual Form'!F29=0,\"\",'AP Accrual Form'!F29)","v":""},{"$f":"IF('AP Accrual Form'!G29=0,\"\",'AP Accrual Form'!G29)","v":""},{"$f":"IF('AP Accrual Form'!H29=0,\"\",'AP Accrual Form'!H29)","v":""},{"$f":"IF('AP Accrual Form'!I29=0,\"\",'AP Accrual Form'!I29)","v":""},{"$f":"IF('AP Accrual Form'!J29=0,\"\",'AP Accrual Form'!J29)","v":""},{"$f":"IF('AP Accrual Form'!K29=0,\"\",-'AP Accrual Form'!K29)","v":""}]
[12,{"$f":"IF('AP Accrual Form'!B30=0,\"\",'AP Accrual Form'!B30)","v":""},{"$f":"IF('AP Accrual Form'!C30=0,\"\",'AP Accrual Form'!C30)","v":""},{"$f":"IF('AP Accrual Form'!D30=0,\"\",VLOOKUP('AP Accrual Form'!D30,Departments!A:C,3,FALSE))","v":""},{"$f":"IF('AP Accrual Form'!E30=0,\"\",'AP Accrual Form'!E30)","v":""},{"$f":"IF('AP Accrual Form'!F30=0,\"\",'AP Accrual Form'!F30)","v":""},{"$f":"IF('AP Accrual Form'!G30=0,\"\",'AP Accrual Form'!G30)","v":""},{"$f":"IF('AP Accrual Form'!H30=0,\"\",'AP Accrual Form'!H30)","v":""},{"$f":"IF('AP Accrual Form'!I30=0,\"\",'AP Accrual Form'!I30)","v":""},{"$f":"IF('AP Accrual Form'!J30=0,\"\",'AP Accrual Form'!J30)","v":""},{"$f":"IF('AP Accrual Form'!K30=0,\"\",-'AP Accrual Form'!K30)","v":""}]
[13,{"$f":"IF('AP Accrual Form'!B31=0,\"\",'AP Accrual Form'!B31)","v":""},{"$f":"IF('AP Accrual Form'!C31=0,\"\",'AP Accrual Form'!C31)","v":""},{"$f":"IF('AP Accrual Form'!D31=0,\"\",VLOOKUP('AP Accrual Form'!D31,Departments!A:C,3,FALSE))","v":""},{"$f":"IF('AP Accrual Form'!E31=0,\"\",'AP Accrual Form'!E31)","v":""},{"$f":"IF('AP Accrual Form'!F31=0,\"\",'AP Accrual Form'!F31)","v":""},{"$f":"IF('AP Accrual Form'!G31=0,\"\",'AP Accrual Form'!G31)","v":""},{"$f":"IF('AP Accrual Form'!H31=0,\"\",'AP Accrual Form'!H31)","v":""},{"$f":"IF('AP Accrual Form'!I31=0,\"\",'AP Accrual Form'!I31)","v":""},{"$f":"IF('AP Accrual Form'!J31=0,\"\",'AP Accrual Form'!J31)","v":""},{"$f":"IF('AP Accrual Form'!K31=0,\"\",-'AP Accrual Form'!K31)","v":""}]
[14,{"$f":"IF('AP Accrual Form'!B32=0,\"\",'AP Accrual Form'!B32)","v":""},{"$f":"IF('AP Accrual Form'!C32=0,\"\",'AP Accrual Form'!C32)","v":""},{"$f":"IF('AP Accrual Form'!D32=0,\"\",VLOOKUP('AP Accrual Form'!D32,Departments!A:C,3,FALSE))","v":""},{"$f":"IF('AP Accrual Form'!E32=0,\"\",'AP Accrual Form'!E32)","v":""},{"$f":"IF('AP Accrual Form'!F32=0,\"\",'AP Accrual Form'!F32)","v":""},{"$f":"IF('AP Accrual Form'!G32=0,\"\",'AP Accrual Form'!G32)","v":""},{"$f":"IF('AP Accrual Form'!H32=0,\"\",'AP Accrual Form'!H32)","v":""},{"$f":"IF('AP Accrual Form'!I32=0,\"\",'AP Accrual Form'!I32)","v":""},{"$f":"IF('AP Accrual Form'!J32=0,\"\",'AP Accrual Form'!J32)","v":""},{"$f":"IF('AP Accrual Form'!K32=0,\"\",-'AP Accrual Form'!K32)","v":""}]
[15,{"$f":"IF('AP Accrual Form'!B33=0,\"\",'AP Accrual Form'!B33)","v":""},{"$f":"IF('AP Accrual Form'!C33=0,\"\",'AP Accrual Form'!C33)","v":""},{"$f":"IF('AP Accrual Form'!D33=0,\"\",VLOOKUP('AP Accrual Form'!D33,Departments!A:C,3,FALSE))","v":""},{"$f":"IF('AP Accrual Form'!E33=0,\"\",'AP Accrual Form'!E33)","v":""},{"$f":"IF('AP Accrual Form'!F33=0,\"\",'AP Accrual Form'!F33)","v":""},{"$f":"IF('AP Accrual Form'!G33=0,\"\",'AP Accrual Form'!G33)","v":""},{"$f":"IF('AP Accrual Form'!H33=0,\"\",'AP Accrual Form'!H33)","v":""},{"$f":"IF('AP Accrual Form'!I33=0,\"\",'AP Accrual Form'!I33)","v":""},{"$f":"IF('AP Accrual Form'!J33=0,\"\",'AP Accrual Form'!J33)","v":""},{"$f":"IF('AP Accrual Form'!K33=0,\"\",-'AP Accrual Form'!K33)","v":""}]
[16,{"$f":"IF('AP Accrual Form'!B34=0,\"\",'AP Accrual Form'!B34)","v":""},{"$f":"IF('AP Accrual Form'!C34=0,\"\",'AP Accrual Form'!C34)","v":""},{"$f":"IF('AP Accrual Form'!D34=0,\"\",VLOOKUP('AP Accrual Form'!D34,Departments!A:C,3,FALSE))","v":""},{"$f":"IF('AP Accrual Form'!E34=0,\"\",'AP Accrual Form'!E34)","v":""},{"$f":"IF('AP Accrual Form'!F34=0,\"\",'AP Accrual Form'!F34)","v":""},{"$f":"IF('AP Accrual Form'!G34=0,\"\",'AP Accrual Form'!G34)","v":""},{"$f":"IF('AP Accrual Form'!H34=0,\"\",'AP Accrual Form'!H34)","v":""},{"$f":"IF('AP Accrual Form'!I34=0,\"\",'AP Accrual Form'!I34)","v":""},{"$f":"IF('AP Accrual Form'!J34=0,\"\",'AP Accrual Form'!J34)","v":""},{"$f":"IF('AP Accrual Form'!K34=0,\"\",-'AP Accrual Form'!K34)","v":""}]
[17,{"$f":"IF('AP Accrual Form'!B35=0,\"\",'AP Accrual Form'!B35)","v":""},{"$f":"IF('AP Accrual Form'!C35=0,\"\",'AP Accrual Form'!C35)","v":""},{"$f":"IF('AP Accrual Form'!D35=0,\"\",VLOOKUP('AP Accrual Form'!D35,Departments!A:C,3,FALSE))","v":""},{"$f":"IF('AP Accrual Form'!E35=0,\"\",'AP Accrual Form'!E35)","v":""},{"$f":"IF('AP Accrual Form'!F35=0,\"\",'AP Accrual Form'!F35)","v":""},{"$f":"IF('AP Accrual Form'!G35=0,\"\",'AP Accrual Form'!G35)","v":""},{"$f":"IF('AP Accrual Form'!H35=0,\"\",'AP Accrual Form'!H35)","v":""},{"$f":"IF('AP Accrual Form'!I35=0,\"\",'AP Accrual Form'!I35)","v":""},{"$f":"IF('AP Accrual Form'!J35=0,\"\",'AP Accrual Form'!J35)","v":""},{"$f":"IF('AP Accrual Form'!K35=0,\"\",-'AP Accrual Form'!K35)","v":""}]
[18,{"$f":"IF('AP Accrual Form'!B36=0,\"\",'AP Accrual Form'!B36)","v":""},{"$f":"IF('AP Accrual Form'!C36=0,\"\",'AP Accrual Form'!C36)","v":""},{"$f":"IF('AP Accrual Form'!D36=0,\"\",VLOOKUP('AP Accrual Form'!D36,Departments!A:C,3,FALSE))","v":""},{"$f":"IF('AP Accrual Form'!E36=0,\"\",'AP Accrual Form'!E36)","v":""},{"$f":"IF('AP Accrual Form'!F36=0,\"\",'AP Accrual Form'!F36)","v":""},{"$f":"IF('AP Accrual Form'!G36=0,\"\",'AP Accrual Form'!G36)","v":""},{"$f":"IF('AP Accrual Form'!H36=0,\"\",'AP Accrual Form'!H36)","v":""},{"$f":"IF('AP Accrual Form'!I36=0,\"\",'AP Accrual Form'!I36)","v":""},{"$f":"IF('AP Accrual Form'!J36=0,\"\",'AP Accrual Form'!J36)","v":""},{"$f":"IF('AP Accrual Form'!K36=0,\"\",-'AP Accrual Form'!K36)","v":""}]
[19,{"$f":"IF('AP Accrual Form'!B37=0,\"\",'AP Accrual Form'!B37)","v":""},{"$f":"IF('AP Accrual Form'!C37=0,\"\",'AP Accrual Form'!C37)","v":""},{"$f":"IF('AP Accrual Form'!D37=0,\"\",VLOOKUP('AP Accrual Form'!D37,Departments!A:C,3,FALSE))","v":""},{"$f":"IF('AP Accrual Form'!E37=0,\"\",'AP Accrual Form'!E37)","v":""},{"$f":"IF('AP Accrual Form'!F37=0,\"\",'AP Accrual Form'!F37)","v":""},{"$f":"IF('AP Accrual Form'!G37=0,\"\",'AP Accrual Form'!G37)","v":""},{"$f":"IF('AP Accrual Form'!H37=0,\"\",'AP Accrual Form'!H37)","v":""},{"$f":"IF('AP Accrual Form'!I37=0,\"\",'AP Accrual Form'!I37)","v":""},{"$f":"IF('AP Accrual Form'!J37=0,\"\",'AP Accrual Form'!J37)","v":""},{"$f":"IF('AP Accrual Form'!K37=0,\"\",-'AP Accrual Form'!K37)","v":""}]
[20,{"$f":"IF('AP Accrual Form'!B38=0,\"\",'AP Accrual Form'!B38)","v":""},{"$f":"IF('AP Accrual Form'!C38=0,\"\",'AP Accrual Form'!C38)","v":""},{"$f":"IF('AP Accrual Form'!D38=0,\"\",VLOOKUP('AP Accrual Form'!D38,Departments!A:C,3,FALSE))","v":""},{"$f":"IF('AP Accrual Form'!E38=0,\"\",'AP Accrual Form'!E38)","v":""},{"$f":"IF('AP Accrual Form'!F38=0,\"\",'AP Accrual Form'!F38)","v":""},{"$f":"IF('AP Accrual Form'!G38=0,\"\",'AP Accrual Form'!G38)","v":""},{"$f":"IF('AP Accrual Form'!H38=0,\"\",'AP Accrual Form'!H38)","v":""},{"$f":"IF('AP Accrual Form'!I38=0,\"\",'AP Accrual Form'!I38)","v":""},{"$f":"IF('AP Accrual Form'!J38=0,\"\",'AP Accrual Form'!J38)","v":""},{"$f":"IF('AP Accrual Form'!K38=0,\"\",-'AP Accrual Form'!K38)","v":""}]
[21,{"$f":"IF('AP Accrual Form'!B39=0,\"\",'AP Accrual Form'!B39)","v":""},{"$f":"IF('AP Accrual Form'!C39=0,\"\",'AP Accrual Form'!C39)","v":""},{"$f":"IF('AP Accrual Form'!D39=0,\"\",VLOOKUP('AP Accrual Form'!D39,Departments!A:C,3,FALSE))","v":""},{"$f":"IF('AP Accrual Form'!E39=0,\"\",'AP Accrual Form'!E39)","v":""},{"$f":"IF('AP Accrual Form'!F39=0,\"\",'AP Accrual Form'!F39)","v":""},{"$f":"IF('AP Accrual Form'!G39=0,\"\",'AP Accrual Form'!G39)","v":""},{"$f":"IF('AP Accrual Form'!H39=0,\"\",'AP Accrual Form'!H39)","v":""},{"$f":"IF('AP Accrual Form'!I39=0,\"\",'AP Accrual Form'!I39)","v":""},{"$f":"IF('AP Accrual Form'!J39=0,\"\",'AP Accrual Form'!J39)","v":""},{"$f":"IF('AP Accrual Form'!K39=0,\"\",-'AP Accrual Form'!K39)","v":""}]
[22,{"$f":"IF('AP Accrual Form'!B40=0,\"\",'AP Accrual Form'!B40)","v":""},{"$f":"IF('AP Accrual Form'!C40=0,\"\",'AP Accrual Form'!C40)","v":""},{"$f":"IF('AP Accrual Form'!D40=0,\"\",VLOOKUP('AP Accrual Form'!D40,Departments!A:C,3,FALSE))","v":""},{"$f":"IF('AP Accrual Form'!E40=0,\"\",'AP Accrual Form'!E40)","v":""},{"$f":"IF('AP Accrual Form'!F40=0,\"\",'AP Accrual Form'!F40)","v":""},{"$f":"IF('AP Accrual Form'!G40=0,\"\",'AP Accrual Form'!G40)","v":""},{"$f":"IF('AP Accrual Form'!H40=0,\"\",'AP Accrual Form'!H40)","v":""},{"$f":"IF('AP Accrual Form'!I40=0,\"\",'AP Accrual Form'!I40)","v":""},{"$f":"IF('AP Accrual Form'!J40=0,\"\",'AP Accrual Form'!J40)","v":""},{"$f":"IF('AP Accrual Form'!K40=0,\"\",-'AP Accrual Form'!K40)","v":""}]
{"$rows_left_out":11}
{"sheet":"Departments","index":2,"n_rows":305,"n_cols":3,"rows_kept":305,"cut":false,"hidden":true,"merged":[]}
["Old Deptid","Description","New DeptId"]
["110101","Office of the President","110101"]
["120101","IRPE","120101"]
["140101","Ombuds Office","140101"]
["210101","University Advancement","210101"]
["220101","Communication & Marketing","220101"]
["230101","University Events","230101"]
["240101","Career Devl & Alumni Engagemnt","240101"]
["250101","University Development","250101"]
["2A0109","Foundation","2A0109"]
["510101","Division of Student Affairs","510101"]
["510201","VP for Student Affairs Office","510201"]
["510301","Assessment, Data & Evaluation","510301"]
["510401","Budget & Staff Resources","510401"]
["510501","Training","510501"]
["520101","AVP ASO Office","520101"]
["520201","Co-Curricular Programs","520201"]
["520402","DSA Comm. & Marketing","520402"]
["520502","DSA Staff Recogn./Spec. Projec","520502"]
["530101","HRE - Residential Education","530101"]
["530201","HRE - Housing Operations","530201"]
["530301","HRE - Housing Administration","530301"]
["530401","HRE - Conferencing","530401"]
["540","Admissions and Recruitment",320540]
["545","Records and Registration",320545]
["546","Student Systems",320546]
["550","Financial Aid",320550]
["550101","CR - Recreation Administration","550101"]
["550102","CR - Sports Clubs","550102"]
["550103","CR - Fitness","550103"]
["550104","CR - Rec Sports","550104"]
["550107","CR - Waterfront & Outdoor Adve","550107"]
["550110","CR - CI Boating Center","550110"]
["550201","CAPS Administration","550201"]
["550220","Counseling & Psychological Srv","550220"]
["550310","Student Health & Wellness Adm","550310"]
["550320","SH- Student Health Services","550320"]
["550420","SH - Wellness Promotion & Educ","550420"]
["550501","Athletics Administration","550501"]
["550701","WA-Disab Accom & Support  Svc","550701"]
{"$rows_left_out":266}
{"sheet":"Upload","index":3,"n_rows":0,"n_cols":0,"rows_kept":0,"cut":false,"hidden":true,"merged":[]}

{"sheet":"MacroUseOnly","index":4,"n_rows":30,"n_cols":15,"rows_kept":30,"cut":false,"hidden":true,"merged":[]}
[null,null,null,null,null,null,null,null,null,null,null,null,null,{"$f":"IF(M1<>\"\",O1,\"\")","v":""},1]
[null,"CIASI",null,null,null,null,null,null,null,null,null,null,null,"",2]
[null,"CICMP",null,null,null,null,null,null,null,null,null,null,null,"",3]
[null,"CICSA",null,null,null,null,null,null,null,null,null,null,null,"",4]
[null,"CIFDN",null,null,null,null,null,null,null,null,null,null,null,"",5]
[null,"CIUGC",null,null,null,null,null,null,null,null,null,null,null,"",6]
[null,null,null,null,null,null,null,null,null,null,null,null,null,"",7]
[null,null,null,null,null,null,null,null,null,null,null,null,null,"",8]
[null,null,null,null,null,null,null,null,null,null,null,null,null,"",9]
[null,null,null,null,null,null,null,null,null,null,null,null,null,"",10]
[null,null,null,null,null,null,null,null,null,null,null,null,null,"",11]
[null,null,null,null,null,null,null,null,null,null,null,null,null,"",12]
[null,null,null,null,null,null,null,null,null,null,null,null,null,"",13]
[null,null,null,null,null,null,null,null,null,null,null,null,null,"",14]
[null,null,null,null,null,null,null,null,null,null,null,null,null,"",15]
[null,null,null,null,null,null,null,null,null,null,null,null,null,"",16]
[null,null,null,null,null,null,null,null,null,null,null,null,null,"",17]
[null,null,null,null,null,null,null,null,null,null,null,null,null,"",18]
[null,null,null,null,null,null,null,null,null,null,null,null,null,"",19]
[null,null,null,null,null,null,null,null,null,null,null,null,null,"",20]
[null,null,null,null,null,null,null,null,null,null,null,null,null,"",21]
[null,null,null,null,null,null,null,null,null,null,null,null,null,"",22]
[null,null,null,null,null,null,null,null,null,null,null,null,null,"",23]
[null,null,null,null,null,null,null,null,null,null,null,null,null,"",24]
[null,null,null,null,null,null,null,null,null,null,null,null,null,"",25]
[null,null,null,null,null,null,null,null,null,null,null,null,null,"",26]
[null,null,null,null,null,null,null,null,null,null,null,null,null,"",27]
[null,null,null,null,null,null,null,null,null,null,null,null,null,"",28]
[null,null,null,null,null,null,null,null,null,null,null,null,null,"",29]
[null,null,null,null,null,null,null,null,null,null,null,null,null,"",30]